BDBM50463293 CHEMBL4242847
SMILES [H][C@@]12Oc3c4c(C[C@@]5([H])N(CC6CC6)CC[C@@]14[C@@]51CC[C@@]2(OC)[C@](C)(C1)C(O)c1cccc(OC)c1)ccc3OC
InChI Key InChIKey=LTFPTZBVXRYZQD-PBJRJVJOSA-N
Data  3 KI
  Tab Delimited (TSV)   2D SDfile   Computed 3D by Vconf -m prep SDfile
Find this compound or compounds like it in BindingDB:
Activity Spreadsheet -- Enzyme Inhibition Constant Data from BindingDB
Found 3 hits for monomerid = 50463293
TargetKappa-type opioid receptor(Homo sapiens (Human))
Fudan University
Curated by ChEMBL
LigandPNGBDBM50463293(CHEMBL4242847)
Affinity DataKi:  2.10nM. Assay description: Displacement of [3H]U69,593 from human KOR expressed in CHO cell membranes after 30 mins by liquid scintillation counting analysis
Ligand InfoPC cidPC sid
In DepthDetails ArticlePubMed
TargetMu-type opioid receptor(Homo sapiens (Human))
Fudan University
Curated by ChEMBL
LigandPNGBDBM50463293(CHEMBL4242847)
Affinity DataKi:  6.30nM. Assay description: Displacement of [3H]DAMGO from human MOR expressed in CHO cell membranes after 30 mins by liquid scintillation counting analysis
Ligand InfoPC cidPC sid
In DepthDetails ArticlePubMed
TargetDelta-type opioid receptor(Homo sapiens (Human))
Fudan University
Curated by ChEMBL
LigandPNGBDBM50463293(CHEMBL4242847)
Affinity DataKi:  26nM. Assay description: Displacement of [3H]DPDPE from human DOR expressed in CHO cell membranes after 30 mins by liquid scintillation counting analysis
Ligand InfoPC cidPC sid
In DepthDetails ArticlePubMed