BDBM50463296 CHEMBL4237854
SMILES [H][C@@]12Oc3c4c(C[C@@]5([H])N(CC6CC6)CC[C@@]14[C@@]51CC[C@@]2(OC)[C@](C)(C1)OC(=O)C(C)C)ccc3OC
InChI Key InChIKey=NGHKLZNREIXDGF-GNEWWROOSA-N
Data  3 KI
  Tab Delimited (TSV)   2D SDfile   Computed 3D by Vconf -m prep SDfile
Find this compound or compounds like it in BindingDB:
Activity Spreadsheet -- Enzyme Inhibition Constant Data from BindingDB
Found 3 hits for monomerid = 50463296
TargetKappa-type opioid receptor(Homo sapiens (Human))
Fudan University
Curated by ChEMBL
LigandPNGBDBM50463296(CHEMBL4237854)
Affinity DataKi:  28nM. Assay description: Displacement of [3H]U69,593 from human KOR expressed in CHO cell membranes after 30 mins by liquid scintillation counting analysis
Ligand InfoPC cidPC sid
In DepthDetails ArticlePubMed
TargetMu-type opioid receptor(Homo sapiens (Human))
Fudan University
Curated by ChEMBL
LigandPNGBDBM50463296(CHEMBL4237854)
Affinity DataKi:  34nM. Assay description: Displacement of [3H]DAMGO from human MOR expressed in CHO cell membranes after 30 mins by liquid scintillation counting analysis
Ligand InfoPC cidPC sid
In DepthDetails ArticlePubMed
TargetDelta-type opioid receptor(Homo sapiens (Human))
Fudan University
Curated by ChEMBL
LigandPNGBDBM50463296(CHEMBL4237854)
Affinity DataKi:  264nM. Assay description: Displacement of [3H]DPDPE from human DOR expressed in CHO cell membranes after 30 mins by liquid scintillation counting analysis
Ligand InfoPC cidPC sid
In DepthDetails ArticlePubMed