BDBM50463472 CHEMBL4242293
SMILES CC1CCN(CC1)c1nc(ccc1CNC(=O)Cc1cc(Cl)c(N)c(Cl)c1)C(F)(F)F
InChI Key InChIKey=SQAKVUWSGHLBGX-UHFFFAOYSA-N
Data  2 KI  2 IC50
  Tab Delimited (TSV)   2D SDfile   Computed 3D by Vconf -m prep SDfile
Find this compound or compounds like it in BindingDB:
Activity Spreadsheet -- Enzyme Inhibition Constant Data from BindingDB
Found 4 hits for monomerid = 50463472
TargetTransient receptor potential cation channel subfamily V member 1(Homo sapiens (Human))
Seoul National University
Curated by ChEMBL
LigandPNGBDBM50463472(CHEMBL4242293)
Affinity DataKi:  0.100nM. Assay description: Antagonist activity at human TRPV1 expressed in CHOK1 cells assessed as reduction in NADA-induced intracellular calcium level preincubated with cells...
Ligand InfoPC cidPC sid
In DepthDetails ArticlePubMed
TargetTransient receptor potential cation channel subfamily V member 1(Homo sapiens (Human))
Seoul National University
Curated by ChEMBL
LigandPNGBDBM50463472(CHEMBL4242293)
Affinity DataKi:  0.300nM. Assay description: Antagonist activity at human TRPV1 expressed in CHOK1 cells assessed as reduction in capsaicin-induced intracellular calcium level preincubated for 6...
Ligand InfoPC cidPC sid
In DepthDetails ArticlePubMed
TargetTransient receptor potential cation channel subfamily V member 1(Homo sapiens (Human))
Seoul National University
Curated by ChEMBL
LigandPNGBDBM50463472(CHEMBL4242293)
Affinity DataIC50:  13nM. Assay description: Antagonist activity at human TRPV1 expressed in CHOK1 cells assessed as reduction in heat-induced intracellular calcium level preincubated with cells...
Ligand InfoPC cidPC sid
In DepthDetails ArticlePubMed
TargetTransient receptor potential cation channel subfamily V member 1(Homo sapiens (Human))
Seoul National University
Curated by ChEMBL
LigandPNGBDBM50463472(CHEMBL4242293)
Affinity DataIC50:  158nM. Assay description: Antagonist activity at human TRPV1 expressed in CHOK1 cells assessed as reduction in low pH-induced receptor activation by measuring decrease in intr...
Ligand InfoPC cidPC sid
In DepthDetails ArticlePubMed