BDBM50463481 CHEMBL4244717
SMILES CC(C)S(=O)(=O)Nc1cccc(CC(=O)Nc2nc(cs2)-c2c[nH]c3ncccc23)c1
InChI Key InChIKey=CXRWTDRYOGHWRG-UHFFFAOYSA-N
Data  1 KI  1 IC50
  Tab Delimited (TSV)   2D SDfile   Computed 3D by Vconf -m prep SDfile
Find this compound or compounds like it in BindingDB:
Activity Spreadsheet -- Enzyme Inhibition Constant Data from BindingDB
Found 2 hits for monomerid = 50463481
TargetRho-associated protein kinase 1(Homo sapiens (Human))
Vertex Pharmaceuticals
Curated by ChEMBL
LigandPNGBDBM50463481(CHEMBL4244717)
Affinity DataKi:  2nM. Assay description: Inhibition of ROCK1 (6 to 553 residues) (unknown origin) using Lys-Lys-Arg-Asn-Arg-Thr-Leu-Ser-Val as substrate in presence of ATP by spectrophotomet...
Ligand InfoPC cidPC sid
In DepthDetails ArticlePubMed
TargetCytochrome P450 3A4(Homo sapiens (Human))
Vertex Pharmaceuticals
Curated by ChEMBL
LigandPNGBDBM50463481(CHEMBL4244717)
Affinity DataIC50:  4.90E+3nM. Assay description: Inhibition of CYP3A4 (unknown origin)
Ligand InfoPC cidPC sid
In DepthDetails ArticlePubMed