BDBM50463488 CHEMBL4247780
SMILES COc1cccc(CC(=O)Nc2nc(cs2)-c2ccnc3[nH]ccc23)c1
InChI Key InChIKey=ASOFRFMFCSKIIT-UHFFFAOYSA-N
Data  1 KI
  Tab Delimited (TSV)   2D SDfile   Computed 3D by Vconf -m prep SDfile
Find this compound or compounds like it in BindingDB:
Activity Spreadsheet -- Enzyme Inhibition Constant Data from BindingDB
Found 1 hit for monomerid = 50463488
TargetRho-associated protein kinase 1(Homo sapiens (Human))
Vertex Pharmaceuticals
Curated by ChEMBL
LigandPNGBDBM50463488(CHEMBL4247780)
Affinity DataKi:  16nM. Assay description: Inhibition of ROCK1 (6 to 553 residues) (unknown origin) using Lys-Lys-Arg-Asn-Arg-Thr-Leu-Ser-Val as substrate in presence of ATP by spectrophotomet...
Ligand InfoPC cidPC sid
In DepthDetails ArticlePubMed