BDBM50463808 CHEMBL4241559
SMILES COCCn1cc(Nc2ncnc3n(Cc4cccc(NC(=O)C=C)c4)ncc23)cn1
InChI Key InChIKey=AJGIBGJJQPWCPV-UHFFFAOYSA-N
Data  1 IC50
  Tab Delimited (TSV)   2D SDfile   Computed 3D by Vconf -m prep SDfile
Find this compound or compounds like it in BindingDB:
Activity Spreadsheet -- Enzyme Inhibition Constant Data from BindingDB
Found 1 hit for monomerid = 50463808
TargetTyrosine-protein kinase JAK3(Homo sapiens (Human))
China Pharmaceutical University
Curated by ChEMBL
LigandPNGBDBM50463808(CHEMBL4241559)
Affinity DataIC50:  267nM. Assay description: Inhibition of recombinant human GST-tagged JAK3 catalytic domain expressed in baculovirus expression system using TK-substrate-biotin preincubated fo...
Ligand InfoPC cidPC sid
In DepthDetails ArticlePubMed