BDBM50463819 CHEMBL4240663
SMILES Cn1cc(cn1)-c1nn(C2CCCN(C2)C#N)c2ncnc(N)c12
InChI Key InChIKey=WXGLVJWYJRSMPC-UHFFFAOYSA-N
Data  2 IC50
  Tab Delimited (TSV)   2D SDfile   Computed 3D by Vconf -m prep SDfile
Find this compound or compounds like it in BindingDB:
Activity Spreadsheet -- Enzyme Inhibition Constant Data from BindingDB
Found 2 hits for monomerid = 50463819
TargetTyrosine-protein kinase JAK3(Homo sapiens (Human))
China Pharmaceutical University
Curated by ChEMBL
LigandPNGBDBM50463819(CHEMBL4240663)
Affinity DataIC50:  115nM. Assay description: Inhibition of recombinant human GST-tagged JAK3 catalytic domain expressed in baculovirus expression system using TK-substrate-biotin preincubated fo...
Ligand InfoPC cidPC sid
In DepthDetails ArticlePubMed
TargetTyrosine-protein kinase JAK2(Homo sapiens (Human))
China Pharmaceutical University
Curated by ChEMBL
LigandPNGBDBM50463819(CHEMBL4240663)
Affinity DataIC50:  168nM. Assay description: Inhibition of recombinant human GST-tagged JAK2 catalytic domain expressed in baculovirus expression system using TK-substrate-biotin preincubated fo...
Ligand InfoPC cidPC sid
In DepthDetails ArticlePubMed