BDBM50464386 CHEMBL4294495
SMILES O=S(=O)(N1CCCC[C@H]1c1cccnc1)c1ccc2OCOc2c1
InChI Key InChIKey=UNXHDCDYSUNWJN-HNNXBMFYSA-N
Data  1 EC50
  Tab Delimited (TSV)   2D SDfile   Computed 3D by Vconf -m prep SDfile
Find this compound or compounds like it in BindingDB:
Activity Spreadsheet -- Enzyme Inhibition Constant Data from BindingDB
Found 1 hit for monomerid = 50464386
TargetGlycine receptor subunit beta(Homo sapiens (Human))
Amgen
Curated by ChEMBL
LigandPNGBDBM50464386(CHEMBL4294495)
Affinity DataEC50: >2.00E+4nM. Assay description: Positive allosteric modulation of human GlyRalpha3beta expressed in HEK293T cells assessed as increase in glycine-induced chloride ion flux measured ...
Ligand InfoPC cidPC sid
In DepthDetails ArticlePubMed