BDBM50464596 CHEMBL4282822
SMILES [H][C@@]12C[C@](C)(O)C=C[C@@]1([H])C(C)(C)Oc1cc(CCCCC)cc(O)c21
InChI Key InChIKey=PGZISGZFEFJPOZ-WHSLLNHNSA-N
Data  4 KI  4 IC50
  Tab Delimited (TSV)   2D SDfile   Computed 3D by Vconf -m prep SDfile
Find this compound or compounds like it in BindingDB:
Activity Spreadsheet -- Enzyme Inhibition Constant Data from BindingDB
Found 8 hits for monomerid = 50464596
TargetCannabinoid receptor 2(Homo sapiens (Human))
The University Of Mississippi
Curated by ChEMBL
LigandPNGBDBM50464596(CHEMBL4282822)
Affinity DataKi:  9.5nM. Assay description: Displacement of [3H]CP-55,940 from recombinant human full length CB2 receptor expressed in HEK293 cell membranes after 90 mins by topcount method
Ligand InfoPC cidPC sid
In DepthDetails ArticlePubMed
TargetCannabinoid receptor 1(Homo sapiens (Human))
The University Of Mississippi
Curated by ChEMBL
LigandPNGBDBM50464596(CHEMBL4282822)
Affinity DataKi:  193nM. Assay description: Agonist activity at recombinant human full length CB1 receptor expressed in HEK293 cell membranes after 2 hrs by [35S]GTP-gammaS binding assay
Ligand InfoPC cidPC sid
In DepthDetails ArticlePubMed
TargetCannabinoid receptor 1(Homo sapiens (Human))
The University Of Mississippi
Curated by ChEMBL
LigandPNGBDBM50464596(CHEMBL4282822)
Affinity DataKi:  470nM. Assay description: Displacement of [3H]CP-55,940 from recombinant human full length CB1 receptor expressed in HEK293 cell membranes after 90 mins by topcount method
Ligand InfoPC cidPC sid
In DepthDetails ArticlePubMed
TargetCannabinoid receptor 2(Homo sapiens (Human))
The University Of Mississippi
Curated by ChEMBL
LigandPNGBDBM50464596(CHEMBL4282822)
Affinity DataKi:  5.70E+3nM. Assay description: Agonist activity at recombinant human full length CB2 receptor expressed in HEK293 cell membranes after 2 hrs by [35S]GTP-gammaS binding assay
Ligand InfoPC cidPC sid
In DepthDetails ArticlePubMed
TargetCannabinoid receptor 1(Homo sapiens (Human))
The University Of Mississippi
Curated by ChEMBL
LigandPNGBDBM50464596(CHEMBL4282822)
Affinity DataIC50:  930nM. Assay description: Displacement of [3H]CP-55,940 from recombinant human full length CB1 receptor expressed in HEK293 cell membranes after 90 mins by topcount method
Ligand InfoPC cidPC sid
In DepthDetails ArticlePubMed
TargetCannabinoid receptor 1(Homo sapiens (Human))
The University Of Mississippi
Curated by ChEMBL
LigandPNGBDBM50464596(CHEMBL4282822)
Affinity DataIC50:  387nM. Assay description: Agonist activity at recombinant human full length CB1 receptor expressed in HEK293 cell membranes after 2 hrs by [35S]GTP-gammaS binding assay
Ligand InfoPC cidPC sid
In DepthDetails ArticlePubMed
TargetCannabinoid receptor 2(Homo sapiens (Human))
The University Of Mississippi
Curated by ChEMBL
LigandPNGBDBM50464596(CHEMBL4282822)
Affinity DataIC50:  1.14E+4nM. Assay description: Agonist activity at recombinant human full length CB2 receptor expressed in HEK293 cell membranes after 2 hrs by [35S]GTP-gammaS binding assay
Ligand InfoPC cidPC sid
In DepthDetails ArticlePubMed
TargetCannabinoid receptor 2(Homo sapiens (Human))
The University Of Mississippi
Curated by ChEMBL
LigandPNGBDBM50464596(CHEMBL4282822)
Affinity DataIC50:  19nM. Assay description: Displacement of [3H]CP-55,940 from recombinant human full length CB2 receptor expressed in HEK293 cell membranes after 90 mins by topcount method
Ligand InfoPC cidPC sid
In DepthDetails ArticlePubMed