BDBM50464969 CHEMBL4290714
SMILES CC(C)(C)OC(=O)N[C@@H](Cc1ccc(OCc2ccccc2)cc1)C(=O)NCC(=O)N[C@@H](C[C@]1(O)C(=O)Nc2ccccc12)C(=O)NCc1ccccc1
InChI Key InChIKey=AGCPIQZMNHMKGB-HQEDOLGZSA-N
Data  6 IC50
  Tab Delimited (TSV)   2D SDfile   Computed 3D by Vconf -m prep SDfile
Find this compound or compounds like it in BindingDB:
Activity Spreadsheet -- Enzyme Inhibition Constant Data from BindingDB
Found 6 hits for monomerid = 50464969
TargetProteasome subunit beta type-9(Homo sapiens (Human))
Universit£
Curated by ChEMBL
LigandPNGBDBM50464969(CHEMBL4290714)
Affinity DataIC50:  1.26E+4nM. Assay description: Inhibition of human 20S immunoproteasome beta-1 using Ac-PAL-AMC as substrate incubated for 15 mins measured for 45 mins by fluorescence assay
Ligand InfoPC cidPC sid
In DepthDetails ArticlePubMed
TargetProteasome subunit beta type-8(Homo sapiens (Human))
Universit£
Curated by ChEMBL
LigandPNGBDBM50464969(CHEMBL4290714)
Affinity DataIC50:  7.80E+3nM. Assay description: Inhibition of human 20S immunoproteasome beta-5 using Suc-LLVY-AMC as substrate incubated for 15 mins measured for 45 mins by fluorescence assay
Ligand InfoPC cidPC sid
In DepthDetails ArticlePubMed
TargetProteasome subunit beta type-1(Homo sapiens (Human))
Universit£
Curated by ChEMBL
LigandPNGBDBM50464969(CHEMBL4290714)
Affinity DataIC50:  1.24E+4nM. Assay description: Inhibition of human 20S constitutive proteasome beta-1 using Z-LLE-betaNA as substrate incubated for 15 mins measured for 45 mins by fluorescence ass...
Ligand InfoPC cidPC sid
In DepthDetails ArticlePubMed
TargetProteasome subunit beta type-10(Homo sapiens (Human))
Universit£
Curated by ChEMBL
LigandPNGBDBM50464969(CHEMBL4290714)
Affinity DataIC50:  8.90E+3nM. Assay description: Inhibition of human 20S immunoproteasome beta-2 using BocLRR-AMC as substrate incubated for 15 mins measured for 45 mins by fluorescence assay
Ligand InfoPC cidPC sid
In DepthDetails ArticlePubMed
TargetProteasome subunit beta type-5(Homo sapiens (Human))
Universit£
Curated by ChEMBL
LigandPNGBDBM50464969(CHEMBL4290714)
Affinity DataIC50:  6.20E+3nM. Assay description: Inhibition of human 20S constitutive proteasome beta-5 using Suc-LLVY-AMC as substrate incubated for 15 mins measured for 45 mins by fluorescence ass...
Ligand InfoPC cidPC sid
In DepthDetails ArticlePubMed
TargetProteasome subunit beta type-2(Homo sapiens (Human))
Universit£
Curated by ChEMBL
LigandPNGBDBM50464969(CHEMBL4290714)
Affinity DataIC50:  3.00E+4nM. Assay description: Inhibition of human 20S constitutive proteasome beta-2 using BocLRR-AMC as substrate incubated for 15 mins measured for 45 mins by fluorescence assay
Ligand InfoPC cidPC sid
In DepthDetails ArticlePubMed