BDBM50466089 CHEMBL4283229
SMILES OC[C@H]1CCC[C@@H](CC1)c1ccc(O)cc1
InChI Key InChIKey=TYZPZHWTUNATHL-RYUDHWBXSA-N
Data  6 EC50
  Tab Delimited (TSV)   2D SDfile   Computed 3D by Vconf -m prep SDfile
Find this compound or compounds like it in BindingDB:
Activity Spreadsheet -- Enzyme Inhibition Constant Data from BindingDB
Found 6 hits for monomerid = 50466089
TargetEstrogen receptor beta(Homo sapiens (Human))
Marquette University
Curated by ChEMBL
LigandPNGBDBM50466089(CHEMBL4283229)
Affinity DataEC50:  50nM. Assay description: Agonist activity at full length ERbeta (unknown origin) after 24 hrs by cell based ERE-driven luciferase reporter gene assay
Ligand InfoPC cidPC sid
In DepthDetails ArticlePubMed
TargetEstrogen receptor(Homo sapiens (Human))
Marquette University
Curated by ChEMBL
LigandPNGBDBM50466089(CHEMBL4283229)
Affinity DataEC50: >3.00E+3nM. Assay description: Agonist activity at full length ERalpha (unknown origin) after 24 hrs by ERE-driven luciferase reporter gene assay
Ligand InfoPC cidPC sid
In DepthDetails ArticlePubMed
TargetEstrogen receptor(Homo sapiens (Human))
Marquette University
Curated by ChEMBL
LigandPNGBDBM50466089(CHEMBL4283229)
Affinity DataEC50: >3.56E+4nM. Assay description: Antagonist activity at full length ERalpha (unknown origin) assessed as reduction in E2 induced response after 24 hrs by cell based ERE-driven lucife...
Ligand InfoPC cidPC sid
In DepthDetails ArticlePubMed
TargetEstrogen receptor beta(Homo sapiens (Human))
Marquette University
Curated by ChEMBL
LigandPNGBDBM50466089(CHEMBL4283229)
Affinity DataEC50:  18nM. Assay description: Inhibition of fluorescein-tagged estrogen binding to GST-tagged ERbeta (unknown origin) ligand binding domain after 1 hr by LanthaScreen TR-FRET assa...
Ligand InfoPC cidPC sid
In DepthDetails ArticlePubMed
TargetEstrogen receptor beta(Homo sapiens (Human))
Marquette University
Curated by ChEMBL
LigandPNGBDBM50466089(CHEMBL4283229)
Affinity DataEC50: >3.56E+4nM. Assay description: Antagonist activity at full length ERbeta (unknown origin) assessed as reduction in E2 induced response after 24 hrs by cell based ERE-driven lucifer...
Ligand InfoPC cidPC sid
In DepthDetails ArticlePubMed
TargetEstrogen receptor(Homo sapiens (Human))
Marquette University
Curated by ChEMBL
LigandPNGBDBM50466089(CHEMBL4283229)
Affinity DataEC50:  96nM. Assay description: Inhibition of fluorescein-tagged estrogen binding to GST-tagged ERalpha (unknown origin) ligand binding domain after 1 hr by LanthaScreen TR-FRET ass...
Ligand InfoPC cidPC sid
In DepthDetails ArticlePubMed