BDBM50466114 CHEMBL188926
SMILES [H][C@]12OC(=O)C(=C)[C@]1([H])[C@@H](C[C@](C)(O)[C@]1([H])C(=O)C=C(C)[C@]21[H])OC(=O)C(C)=C
InChI Key InChIKey=DCIRUFYVMCAGPO-OKDOHPPQSA-N
Data  2 IC50
  Tab Delimited (TSV)   2D SDfile   Computed 3D by Vconf -m prep SDfile
Find this compound or compounds like it in BindingDB:
Activity Spreadsheet -- Enzyme Inhibition Constant Data from BindingDB
Found 2 hits for monomerid = 50466114
TargetDihydroorotate dehydrogenase (fumarate)(Leishmania major)
University Of S£O Paulo
Curated by ChEMBL
LigandPNGBDBM50466114(CHEMBL188926)
Affinity DataIC50:  6.31E+5nM. Assay description: Inhibition of recombinant oligo-histidine-tagged Leishmania major DHODH expressed in Escherichia coli BL21(DE3) cells using DHO as substrate measured...
Ligand InfoPC cidPC sid
In DepthDetails ArticlePubMed
TargetDihydroorotate dehydrogenase (fumarate)(Leishmania major)
University Of S£O Paulo
Curated by ChEMBL
LigandPNGBDBM50466114(CHEMBL188926)
Affinity DataIC50:  6.62E+5nM. Assay description: Inhibition of recombinant oligo-histidine-tagged Leishmania major DHODH expressed in Escherichia coli BL21(DE3) cells using DHO as substrate measured...
Ligand InfoPC cidPC sid
In DepthDetails ArticlePubMed