BDBM50466442 CHEMBL4284688
SMILES CCOC(=O)c1cn(C(=O)C2CC2)c2ncccc12
InChI Key InChIKey=CKTYQMAZMHXBCO-UHFFFAOYSA-N
Data  1 IC50
  Tab Delimited (TSV)   2D SDfile   Computed 3D by Vconf -m prep SDfile
Find this compound or compounds like it in BindingDB:
Activity Spreadsheet -- Enzyme Inhibition Constant Data from BindingDB
Found 1 hit for monomerid = 50466442
TargetNeutrophil elastase(Homo sapiens (Human))
University Of Florence
Curated by ChEMBL
LigandPNGBDBM50466442(CHEMBL4284688)
Affinity DataIC50:  620nM. Assay description: Inhibition of human neutrophil elastase using N-methylsuccinyl-Ala-Ala-Pro-Val-7-amino-4-methylcoumarin as substrate measured every 30 secs for 10 mi...
Ligand InfoPC cidPC sid
In DepthDetails ArticlePubMed