BDBM50466613 CHEMBL4287656
SMILES [I-].CC[N+](CC)(CC)CCOc1ccc(\C=C\c2cc(OC)cc(OC)c2)cc1
InChI Key InChIKey=WQOBFWQJRGVMQX-MDZDMXLPSA-N
Data  1 KI  2 IC50
  Tab Delimited (TSV)   2D SDfile   Computed 3D by Vconf -m prep SDfile
Find this compound or compounds like it in BindingDB:
Activity Spreadsheet -- Enzyme Inhibition Constant Data from BindingDB
Found 3 hits for monomerid = 50466613
TargetNeuronal acetylcholine receptor subunit alpha-7(Homo sapiens (Human))
Universit£
Curated by ChEMBL
LigandPNGBDBM50466613(CHEMBL4287656)
Affinity DataKi:  189nM. Assay description: Displacement of [125I]-alpha-bungarotoxin from human alpha7 nAChR expressed in human SH-SY5Y cell membranes after 30 mins by gamma counting analysis
Ligand InfoPC cidPC sid
In DepthDetails ArticlePubMed
TargetNeuronal acetylcholine receptor subunit alpha-7(Homo sapiens (Human))
Universit£
Curated by ChEMBL
LigandPNGBDBM50466613(CHEMBL4287656)
Affinity DataIC50:  47nM. Assay description: Antagonist activity at human alpha7 nACHR expressed in xenopous laevis oocyte assessed as inhibition of ACh-induced channel current after 5 mins at -...
Ligand InfoPC cidPC sid
In DepthDetails ArticlePubMed
TargetNeuronal acetylcholine receptor; alpha9/alpha10(Homo sapiens (Human))
Universit£
Curated by ChEMBL
LigandPNGBDBM50466613(CHEMBL4287656)
Affinity DataIC50:  17nM. Assay description: Antagonist activity at human alpha9alpha10 nACHR expressed in xenopous laevis oocyte assessed as inhibition of ACh-induced channel current after 5 mi...
Ligand InfoPC cidPC sid
In DepthDetails ArticlePubMed