BDBM50467582 CHEMBL4276719
SMILES CCCCc1ccccc1NCc1ccc(s1)C(=O)Nc1nc(CC(O)=O)cs1
InChI Key InChIKey=YSRCIJVCLXAWIY-UHFFFAOYSA-N
Data  9 IC50
  Tab Delimited (TSV)   2D SDfile   Computed 3D by Vconf -m prep SDfile
Find this compound or compounds like it in BindingDB:
Activity Spreadsheet -- Enzyme Inhibition Constant Data from BindingDB
Found 9 hits for monomerid = 50467582
TargetCytochrome P450 3A4(Homo sapiens (Human))
Japan Tobacco
Curated by ChEMBL
LigandPNGBDBM50467582(CHEMBL4276719)
Affinity DataIC50: >5.00E+4nM. Assay description: Inhibition of CYP3A4 (unknown origin)
Ligand InfoPC cidPC sid
In DepthDetails ArticlePubMed
TargetCytochrome P450 2C9(Homo sapiens (Human))
Japan Tobacco
Curated by ChEMBL
LigandPNGBDBM50467582(CHEMBL4276719)
Affinity DataIC50: >5.00E+4nM. Assay description: Inhibition of CYP2C9 (unknown origin)
Ligand InfoPC cidPC sid
In DepthDetails ArticlePubMed
TargetCytochrome P450 2A6(Homo sapiens (Human))
Japan Tobacco
Curated by ChEMBL
LigandPNGBDBM50467582(CHEMBL4276719)
Affinity DataIC50: >5.00E+4nM. Assay description: Inhibition of CYP2A6 (unknown origin)
Ligand InfoPC cidPC sid
In DepthDetails ArticlePubMed
TargetAcyl-CoA desaturase 1(Rattus norvegicus (Rat))
Japan Tobacco
Curated by ChEMBL
LigandPNGBDBM50467582(CHEMBL4276719)
Affinity DataIC50:  6.5nM. Assay description: Inhibition of rat liver microsome SCD assessed as reduction in [3H]H2O production using stearoyl [9,10-3H]CoA as substrate in presence of NADH incuba...
Ligand InfoPC cidPC sid
In DepthDetails ArticlePubMed
TargetCytochrome P450 1A2(Homo sapiens (Human))
Japan Tobacco
Curated by ChEMBL
LigandPNGBDBM50467582(CHEMBL4276719)
Affinity DataIC50: >5.00E+4nM. Assay description: Inhibition of CYP1A2 (unknown origin)
Ligand InfoPC cidPC sid
In DepthDetails ArticlePubMed
TargetStearoyl-CoA desaturase(Homo sapiens (Human))
Japan Tobacco
Curated by ChEMBL
LigandPNGBDBM50467582(CHEMBL4276719)
Affinity DataIC50:  8.80nM. Assay description: Inhibition of recombinant human SCD1 expressed in baculovirus expression system assessed as reduction in [3H]H2O production using stearoyl [9,10-3H]C...
Ligand InfoPC cidPC sid
In DepthDetails ArticlePubMed
TargetAcyl-CoA desaturase 1(Mus musculus)
Japan Tobacco
Curated by ChEMBL
LigandPNGBDBM50467582(CHEMBL4276719)
Affinity DataIC50:  5.40nM. Assay description: Inhibition of mouse liver microsome SCD assessed as reduction in [3H]H2O production using stearoyl [9,10-3H]CoA as substrate in presence of NADH incu...
Ligand InfoPC cidPC sid
In DepthDetails ArticlePubMed
TargetCytochrome P450 2D6(Homo sapiens (Human))
Japan Tobacco
Curated by ChEMBL
LigandPNGBDBM50467582(CHEMBL4276719)
Affinity DataIC50: >5.00E+4nM. Assay description: Inhibition of CYP2D6 (unknown origin)
Ligand InfoPC cidPC sid
In DepthDetails ArticlePubMed
TargetCytochrome P450 2C19(Homo sapiens (Human))
Japan Tobacco
Curated by ChEMBL
LigandPNGBDBM50467582(CHEMBL4276719)
Affinity DataIC50: >5.00E+4nM. Assay description: Inhibition of CYP2C19 (unknown origin)
Ligand InfoPC cidPC sid
In DepthDetails ArticlePubMed