BDBM50467648 CHEMBL4279990
SMILES CC(=O)c1ccc(OCc2ccccn2)c(c1)-c1ccc2CCNCc2c1
InChI Key InChIKey=GXBBCNAVTVALHI-UHFFFAOYSA-N
Data  2 IC50
  Tab Delimited (TSV)   2D SDfile   Computed 3D by Vconf -m prep SDfile
Find this compound or compounds like it in BindingDB:
Activity Spreadsheet -- Enzyme Inhibition Constant Data from BindingDB
Found 2 hits for monomerid = 50467648
TargetTyrosine-protein kinase SYK(Homo sapiens (Human))
Glaxosmithkline R&D
Curated by ChEMBL
LigandPNGBDBM50467648(CHEMBL4279990)
Affinity DataIC50:  3.16E+3nM. Assay description: Inhibition of recombinant human N-terminal His6-tagged SYK expressed in baculovirus expression system using Biotin-AAAEEIYGEI as substrate after 60 m...
Ligand InfoPC cidPC sid
In DepthDetails ArticlePubMed
TargetAurora kinase B/Inner centromere protein(Homo sapiens (Human))
Glaxosmithkline R&D
Curated by ChEMBL
LigandPNGBDBM50467648(CHEMBL4279990)
Affinity DataIC50: <2.51E+4nM. Assay description: Inhibition of recombinant human FLAG/His6-tagged Aurora-B (2 to 344 residues)/GST-tagged INCENP preincubated for 30 mins followed by 5FAM-PKA-tide su...
Ligand InfoPC cidPC sid
In DepthDetails ArticlePubMed