BDBM50468173 CHEMBL4284995
SMILES CN(C(=O)CCC[C@H](NC(=O)N[C@@H](CCC(O)=O)C(O)=O)C(O)=O)c1ccc(F)nc1
InChI Key InChIKey=UUDMXDXHNXMSOT-RYUDHWBXSA-N
Data  1 IC50
PDB links: 1 PDB ID matches this monomer.
  Tab Delimited (TSV)   2D SDfile   Computed 3D by Vconf -m prep SDfile
Find this compound or compounds like it in BindingDB:
Activity Spreadsheet -- Enzyme Inhibition Constant Data from BindingDB
Found 1 hit for monomerid = 50468173
TargetGlutamate carboxypeptidase 2(Homo sapiens (Human))
University Of Illinois At Chicago
Curated by ChEMBL
LigandPNGBDBM50468173(CHEMBL4284995)
Affinity DataIC50:  0.0750nM. Assay description: Inhibition of recombinant human PSMA using [3H]NAAG as substrate preincubated for 15 mins followed by substrate addition measured after 20 mins by li...
Ligand InfoPC cidPC sidPDB