BDBM50468229 CHEMBL4282646
SMILES C[C@H]1OC(=O)\C=C\[C@@H](O)[C@@H](O)CCCCCCCC[C@@H]1O
InChI Key InChIKey=OXTXYWGSTRVDDS-MLCUHWOYSA-N
Data  1 IC50
  Tab Delimited (TSV)   2D SDfile   Computed 3D by Vconf -m prep SDfile
Find this compound or compounds like it in BindingDB:
Activity Spreadsheet -- Enzyme Inhibition Constant Data from BindingDB
Found 1 hit for monomerid = 50468229
TargetStromelysin-1(Homo sapiens (Human))
University Of Illinois At Chicago
Curated by ChEMBL
LigandPNGBDBM50468229(CHEMBL4282646)
Affinity DataIC50:  1.50E+5nM. Assay description: Inhibition of MMP3 (unknown origin)
In DepthDetails ArticlePubMed