BDBM50468297 CHEMBL4282897
SMILES CNC(=O)\C=C\c1ccc(O)c2oc(cc12)-c1ccc(O)c(O)c1
InChI Key InChIKey=KCPGOVSYAZCUIV-QPJJXVBHSA-N
Data  2 KI  1 IC50
  Tab Delimited (TSV)   2D SDfile   Computed 3D by Vconf -m prep SDfile
Find this compound or compounds like it in BindingDB:
Activity Spreadsheet -- Enzyme Inhibition Constant Data from BindingDB
Found 3 hits for monomerid = 50468297
TargetXanthine dehydrogenase/oxidase(Bos taurus (Bovine))
China Pharmaceutical University
Curated by ChEMBL
LigandPNGBDBM50468297(CHEMBL4282897)
Affinity DataKi:  3.52E+3nM. Assay description: Competitive inhibition of bovine xanthine oxidase using xanthine as substrate preincubated for 3 mins followed by substrate addition by Lineweaver-Bu...
Ligand InfoPC cidPC sid
In DepthDetails ArticlePubMed
TargetXanthine dehydrogenase/oxidase(Bos taurus (Bovine))
China Pharmaceutical University
Curated by ChEMBL
LigandPNGBDBM50468297(CHEMBL4282897)
Affinity DataKi:  1.31E+4nM. Assay description: Uncompetitive inhibition of bovine xanthine oxidase using xanthine as substrate preincubated for 3 mins followed by substrate addition by Lineweaver-...
Ligand InfoPC cidPC sid
In DepthDetails ArticlePubMed
TargetXanthine dehydrogenase/oxidase(Bos taurus (Bovine))
China Pharmaceutical University
Curated by ChEMBL
LigandPNGBDBM50468297(CHEMBL4282897)
Affinity DataIC50:  4.45E+3nM. Assay description: Inhibition of bovine xanthine oxidase using xanthine as substrate preincubated for 3 mins followed by substrate addition and measured for every 15 se...
Ligand InfoPC cidPC sid
In DepthDetails ArticlePubMed