BDBM50468577 CHEMBL4283796
SMILES CCN(CC(O)=O)CC(=O)N1CCC[C@H]1c1cc(C(=O)Nc2ncc(F)s2)c(C)s1
InChI Key InChIKey=QHWCZMIEZBADPE-ZDUSSCGKSA-N
Data  1 IC50
  Tab Delimited (TSV)   2D SDfile   Computed 3D by Vconf -m prep SDfile
Find this compound or compounds like it in BindingDB:
Activity Spreadsheet -- Enzyme Inhibition Constant Data from BindingDB
Found 1 hit for monomerid = 50468577
TargetPotassium voltage-gated channel subfamily H member 2(Homo sapiens (Human))
Sanwa Kagaku Kenkyusho
Curated by ChEMBL
LigandPNGBDBM50468577(CHEMBL4283796)
Affinity DataIC50: >3.00E+5nM. Assay description: Inhibition of human ERG expressed in HEK293 cells at -80 holding potential by whole patch clamp assay
Ligand InfoPC cidPC sid
In DepthDetails ArticlePubMed