BDBM50469527 CHEMBL4289001
SMILES O=C(CCN1CCN(CC1)c1nsc2ccccc12)c1cc2CCCN3C(=O)CCc(c1)c23
InChI Key InChIKey=IMIYBLLQQOUBRO-UHFFFAOYSA-N
Data  3 KI
  Tab Delimited (TSV)   2D SDfile   Computed 3D by Vconf -m prep SDfile
Find this compound or compounds like it in BindingDB:
Activity Spreadsheet -- Enzyme Inhibition Constant Data from BindingDB
Found 3 hits for monomerid = 50469527
Target5-hydroxytryptamine receptor 2A(Rattus norvegicus (rat))
Huazhong University Of Science And Technology
Curated by ChEMBL
LigandPNGBDBM50469527(CHEMBL4289001)
Affinity DataKi:  72nM. Assay description: Displacement of [3H]-ketanserine from serotonin 5-HT2A receptor in rat brain cortex homogenates incubated for 30 mins by liquid scintillation countin...
Ligand InfoPC cidPC sid
In DepthDetails ArticlePubMed
Target5-hydroxytryptamine receptor 1A(Rattus norvegicus (rat))
Huazhong University Of Science And Technology
Curated by ChEMBL
LigandPNGBDBM50469527(CHEMBL4289001)
Affinity DataKi:  129nM. Assay description: Displacement of [3H]-8-OH-DPAT from serotonin 5-HT1A receptor in rat brain cortex homogenates incubated for 30 mins by liquid scintillation counting
Ligand InfoPC cidPC sid
In DepthDetails ArticlePubMed
TargetD(2) dopamine receptor(Rattus norvegicus (rat))
Huazhong University Of Science And Technology
Curated by ChEMBL
LigandPNGBDBM50469527(CHEMBL4289001)
Affinity DataKi:  182nM. Assay description: Displacement of [3H]-spiperone from dopamine D2 receptor in rat striatum homogenates after 30 mins by liquid scintillation counting
Ligand InfoPC cidPC sid
In DepthDetails ArticlePubMed