BDBM50470184 CHEMBL304203
SMILES COc1ccc2ccc(OC)c(CCNC(=O)C3CC3)c2c1
InChI Key InChIKey=XFLRJXFELAMQAW-UHFFFAOYSA-N
Data  1 KI
  Tab Delimited (TSV)   2D SDfile   Computed 3D by Vconf -m prep SDfile
Find this compound or compounds like it in BindingDB:
Activity Spreadsheet -- Enzyme Inhibition Constant Data from BindingDB
Found 1 hit for monomerid = 50470184
TargetMelatonin receptor type 1C(Gallus gallus)
Cnrs-Biocis
Curated by ChEMBL
LigandPNGBDBM50470184(CHEMBL304203)
Affinity DataKi:  0.0500nM. Assay description: Competitive binding by the displacement of 2-[125I]- Iodomelatonin binding from melatonin receptors in chicken brain membranes
Ligand InfoPC cidPC sid
In DepthDetails ArticlePubMed