BDBM50470734 CHEMBL287226
SMILES COc1ccc(cc1OC1CCCC1)C1CCN(C1)C(=O)C(C)C
InChI Key InChIKey=VBFVRCZURXZXLS-UHFFFAOYSA-N
Data  1 KI
  Tab Delimited (TSV)   2D SDfile   Computed 3D by Vconf -m prep SDfile
Find this compound or compounds like it in BindingDB:
Activity Spreadsheet -- Enzyme Inhibition Constant Data from BindingDB
Found 1 hit for monomerid = 50470734
TargetcAMP-specific 3',5'-cyclic phosphodiesterase 4B(Homo sapiens (Human))
Glaxo Research Institute
Curated by ChEMBL
LigandPNGBDBM50470734(CHEMBL287226)
Affinity DataKi:  316nM. Assay description: Inhibition of cAMP hydrolysis by the human phosphodiesterase 4B enzyme
Ligand InfoPC cidPC sid
In DepthDetails ArticlePubMed