BDBM50471081 CHEMBL1627420
SMILES [H][C@@]12CC[C@H](O)[C@@]1(C)CC[C@]1([H])c3cc(CCCO)c(O)cc3CC[C@@]21[H]
InChI Key InChIKey=OMLNKIQCBRKHOW-OKSLILNBSA-N
Data  3 EC50
  Tab Delimited (TSV)   2D SDfile   Computed 3D by Vconf -m prep SDfile
Find this compound or compounds like it in BindingDB:
Activity Spreadsheet -- Enzyme Inhibition Constant Data from BindingDB
Found 3 hits for monomerid = 50471081
TargetEstrogen receptor beta(Homo sapiens (Human))
Ohio State University
Curated by ChEMBL
LigandPNGBDBM50471081(CHEMBL1627420)
Affinity DataEC50:  495nM. Assay description: Induction of pS2 mRNA expression in human MCF-7 mammary carcinoma cells
Ligand InfoPC cidPC sid
In DepthDetails ArticlePubMed
TargetEstrogen receptor beta(Homo sapiens (Human))
Ohio State University
Curated by ChEMBL
LigandPNGBDBM50471081(CHEMBL1627420)
Affinity DataEC50:  0.00400nM. Assay description: Induction of pS2 mRNA expression in human MCF-7 mammary carcinoma cells
Ligand InfoPC cidPC sid
In DepthDetails ArticlePubMed
TargetEstrogen receptor beta(Homo sapiens (Human))
Ohio State University
Curated by ChEMBL
LigandPNGBDBM50471081(CHEMBL1627420)
Affinity DataEC50:  5.22E+3nM. Assay description: Affinity estrogen receptor of MCF-7 human mammary cancer cells
Ligand InfoPC cidPC sid
In DepthDetails ArticlePubMed