BDBM50471306 CHEMBL86856
SMILES CC(C(=O)N[C@@H](CO)C(=O)N[C@@H](CCCCN)C(=O)N[C@@H](CC1CCCCC1)C(O)=O)c1ccc(CCCCn2ccnc2C)cc1
InChI Key InChIKey=DHKCVIJISBXPOV-ZTPVPOQDSA-N
Data  2 IC50
  Tab Delimited (TSV)   2D SDfile   Computed 3D by Vconf -m prep SDfile
Find this compound or compounds like it in BindingDB:
Activity Spreadsheet -- Enzyme Inhibition Constant Data from BindingDB
Found 2 hits for monomerid = 50471306
TargetGlycylpeptide N-tetradecanoyltransferase 1/2(Homo sapiens (Human))
G.D. Searle
Curated by ChEMBL
LigandPNGBDBM50471306(CHEMBL86856)
Affinity DataIC50:  8.40E+5nM. Assay description: Inhibition activity against N-myristoyltransferase (NMT) of human.
Ligand InfoPC cidPC sid
In DepthDetails ArticlePubMed
TargetGlycylpeptide N-tetradecanoyltransferase 1/2(Homo sapiens (Human))
G.D. Searle
Curated by ChEMBL
LigandPNGBDBM50471306(CHEMBL86856)
Affinity DataIC50:  380nM. Assay description: Inhibition activity against N-myristoyltransferase (NMT) of candida albicans.
Ligand InfoPC cidPC sid
In DepthDetails ArticlePubMed