BDBM50472429 CHEMBL342297
SMILES [Na;v0+].[H][C@@]1([#6]-[#6](-[#8-])=O)[#6]-[#6]-[#6]-[#6@H](-[#6]-[#6]-[#6](-[#8])-[#6]-[#6]-[#6]-[#6]-c2ccccc2)-[#6]1
InChI Key InChIKey=JMFQGZZNRXNFMN-UZBPGRBUSA-M
Data  1 IC50
  Tab Delimited (TSV)   2D SDfile   Computed 3D by Vconf -m prep SDfile
Find this compound or compounds like it in BindingDB:
Activity Spreadsheet -- Enzyme Inhibition Constant Data from BindingDB
Found 1 hit for monomerid = 50472429
TargetLeukotriene B4 receptor 2(Homo sapiens (Human))
Cnrs 5074
Curated by ChEMBL
LigandPNGBDBM50472429(CHEMBL342297)
Affinity DataIC50:  2.60E+3nM. Assay description: Inhibition of binding of [3H]LTB4 (1 nM) to intact human polymorphonuclear leukocytes (PMNs)
Ligand InfoPC cidPC sid
In DepthDetails ArticlePubMed