BDBM50474220 CHEMBL3349517
SMILES [H][C@]1(NC(=O)[C@H](CCCCN)NC(=O)[C@H](Cc2c[nH]c3ccccc23)NC(=O)[C@H](Cc2ccccc2)NC(=O)[C@H](Cc2ccccc2)NC(=O)[C@H](CC(N)=O)NC(=O)[C@H](CCCCN)NC(=O)[C@H](CSSC[C@H](NC(=O)[C@H](CO)NC(=O)[C@H](C)NC(=O)[C@H](Cc2ccccc2)NC1=O)C(N)=O)NC(=O)CNC(=O)[C@H](C)N)[C@@H](C)O
InChI Key InChIKey=HAZKRENFRTVGPO-IYHFWKIMSA-N
Data  5 KI
  Tab Delimited (TSV)   2D SDfile   Computed 3D by Vconf -m prep SDfile
Find this compound or compounds like it in BindingDB:
Activity Spreadsheet -- Enzyme Inhibition Constant Data from BindingDB
Found 5 hits for monomerid = 50474220
TargetSomatostatin receptor type 5(Homo sapiens (Human))
Novartis Pharma
Curated by ChEMBL
LigandPNGBDBM50474220(CHEMBL3349517)
Affinity DataKi:  0.398nM. Assay description: Binding affinity towards human Somatostatin receptor type 5 (sst5) using Tyr11-[125I]-SRIF as radioligand was determined in COS cell
Ligand InfoKEGGPC cidPC sid
In DepthDetails ArticlePubMed
TargetSomatostatin receptor type 1(Homo sapiens (Human))
Novartis Pharma
Curated by ChEMBL
LigandPNGBDBM50474220(CHEMBL3349517)
Affinity DataKi:  0.501nM. Assay description: Binding affinity towards human Somatostatin receptor type 1 (sst1) using Tyr11-[125I]-SRIF as radioligand was determined in CHO cells
Ligand InfoKEGGPC cidPC sid
In DepthDetails ArticlePubMed
TargetSomatostatin receptor type 3(Homo sapiens (Human))
Novartis Pharma
Curated by ChEMBL
LigandPNGBDBM50474220(CHEMBL3349517)
Affinity DataKi:  0.631nM. Assay description: Binding affinity towards human Somatostatin receptor type 3 (sst3) using Tyr11-[125I]-SRIF as radioligand was determined in CHO cells
Ligand InfoKEGGPC cidPC sid
In DepthDetails ArticlePubMed
TargetSomatostatin receptor type 4(Homo sapiens (Human))
Novartis Pharma
Curated by ChEMBL
LigandPNGBDBM50474220(CHEMBL3349517)
Affinity DataKi: <0.631nM. Assay description: Binding affinity towards human Somatostatin receptor type 4 (sst4) using Tyr11-[125I]-SRIF as radioligand was determined in CHO cells
Ligand InfoKEGGPC cidPC sid
In DepthDetails ArticlePubMed
TargetSomatostatin receptor type 2(Homo sapiens (Human))
Novartis Pharma
Curated by ChEMBL
LigandPNGBDBM50474220(CHEMBL3349517)
Affinity DataKi:  1.30nM. Assay description: Binding affinity towards human Somatostatin receptor type 2 (sst2) using Tyr11-[125I]-SRIF as radioligand was determined in CHO cells
Ligand InfoKEGGPC cidPC sid
In DepthDetails ArticlePubMed