BDBM50474874 CHEMBL366280
SMILES CCCCCSCCCCCCCCCC\C(=C(\CC)c1ccc(O)cc1)c1ccc(O)cc1
InChI Key InChIKey=KCFMHFUAXFCKIV-NVQSTNCTSA-N
Data  2 IC50
  Tab Delimited (TSV)   2D SDfile   Computed 3D by Vconf -m prep SDfile
Find this compound or compounds like it in BindingDB:
Activity Spreadsheet -- Enzyme Inhibition Constant Data from BindingDB
Found 2 hits for monomerid = 50474874
TargetEstrogen receptor beta(Homo sapiens (Human))
Universit£T Regensburg
Curated by ChEMBL
LigandPNGBDBM50474874(CHEMBL366280)
Affinity DataIC50:  1.40E+3nM. Assay description: Inhibition of 10e-9 M E2 stimulated MCF-7 breast cancer cell proliferation
Ligand InfoPC cidPC sid
In DepthDetails ArticlePubMed
TargetEstrogen receptor beta(Homo sapiens (Human))
Universit£T Regensburg
Curated by ChEMBL
LigandPNGBDBM50474874(CHEMBL366280)
Affinity DataIC50:  790nM. Assay description: Inhibition of 10e-9 M E2 stimulated transcriptional activation in ER+MCF-7/2a breast cancer cells
Ligand InfoPC cidPC sid
In DepthDetails ArticlePubMed