BDBM50475575 CHEMBL199754
SMILES N[C@@H](COP(O)(O)=O)[C@H](O)\C=C\CCCCCCCCCCNc1ccc([N+]([O-])=O)c2nonc12
InChI Key InChIKey=LYPZBCWBZNVKMO-XABOCNADSA-N
Data  4 EC50
  Tab Delimited (TSV)   2D SDfile   Computed 3D by Vconf -m prep SDfile
Find this compound or compounds like it in BindingDB:
Activity Spreadsheet -- Enzyme Inhibition Constant Data from BindingDB
Found 4 hits for monomerid = 50475575
TargetSphingosine 1-phosphate receptor 5(Homo sapiens (Human))
Novartis Institutes For Biomedical Research
Curated by ChEMBL
LigandPNGBDBM50475575(CHEMBL199754)
Affinity DataEC50:  50nM. Assay description: Binding potency at human S1P5 receptor by [35S]GTP-gamma-S binding assay
Ligand InfoPC cidPC sid
In DepthDetails ArticlePubMed
TargetSphingosine 1-phosphate receptor 3(Homo sapiens (Human))
Novartis Institutes For Biomedical Research
Curated by ChEMBL
LigandPNGBDBM50475575(CHEMBL199754)
Affinity DataEC50:  5nM. Assay description: Binding potency at human S1P3 receptor by [35S]GTP-gamma-S binding assay
Ligand InfoPC cidPC sid
In DepthDetails ArticlePubMed
TargetSphingosine 1-phosphate receptor 1(Homo sapiens (Human))
Novartis Institutes For Biomedical Research
Curated by ChEMBL
LigandPNGBDBM50475575(CHEMBL199754)
Affinity DataEC50:  63nM. Assay description: Binding potency at human S1P1 receptor by [35S]GTP-gamma-S binding assay
Ligand InfoPC cidPC sid
In DepthDetails ArticlePubMed
TargetSphingosine 1-phosphate receptor 4(Homo sapiens (Human))
Novartis Institutes For Biomedical Research
Curated by ChEMBL
LigandPNGBDBM50475575(CHEMBL199754)
Affinity DataEC50:  63nM. Assay description: Binding potency at human S1P4 receptor by [35S]GTP-gamma-S binding assay
Ligand InfoPC cidPC sid
In DepthDetails ArticlePubMed