BDBM50475577 CHEMBL382739
SMILES CCCCCCCOc1ccc(CC[C@@](C)(N)COP(O)(O)=O)cc1
InChI Key InChIKey=NMRLBSIYIBOLLJ-GOSISDBHSA-N
Data  4 EC50
  Tab Delimited (TSV)   2D SDfile   Computed 3D by Vconf -m prep SDfile
Find this compound or compounds like it in BindingDB:
Activity Spreadsheet -- Enzyme Inhibition Constant Data from BindingDB
Found 4 hits for monomerid = 50475577
TargetSphingosine 1-phosphate receptor 3(Homo sapiens (Human))
Novartis Institutes For Biomedical Research
Curated by ChEMBL
LigandPNGBDBM50475577(CHEMBL382739)
Affinity DataEC50:  6.30nM. Assay description: Binding potency at human S1P3 receptor by [35S]GTP-gamma-S binding assay
Ligand InfoPC cidPC sid
In DepthDetails ArticlePubMed
TargetSphingosine 1-phosphate receptor 4(Homo sapiens (Human))
Novartis Institutes For Biomedical Research
Curated by ChEMBL
LigandPNGBDBM50475577(CHEMBL382739)
Affinity DataEC50:  1.30nM. Assay description: Binding potency at human S1P4 receptor by [35S]GTP-gamma-S binding assay
Ligand InfoPC cidPC sid
In DepthDetails ArticlePubMed
TargetSphingosine 1-phosphate receptor 5(Homo sapiens (Human))
Novartis Institutes For Biomedical Research
Curated by ChEMBL
LigandPNGBDBM50475577(CHEMBL382739)
Affinity DataEC50:  2nM. Assay description: Binding potency at human S1P5 receptor by [35S]GTP-gamma-S binding assay
Ligand InfoPC cidPC sid
In DepthDetails ArticlePubMed
TargetSphingosine 1-phosphate receptor 1(Homo sapiens (Human))
Novartis Institutes For Biomedical Research
Curated by ChEMBL
LigandPNGBDBM50475577(CHEMBL382739)
Affinity DataEC50:  0.794nM. Assay description: Binding potency at human S1P1 receptor by [35S]GTP-gamma-S binding assay
Ligand InfoPC cidPC sid
In DepthDetails ArticlePubMed