BDBM50476866 CHEMBL231941
SMILES CC(C)CCNC(=O)C1(CCC1)C(=O)N[C@H]1N=C(c2ccc(cc2)C(F)(F)F)c2ccccc2N(C)C1=O
InChI Key InChIKey=XLPQYPXPTMEQNC-HSZRJFAPSA-N
Data  1 KI  1 IC50
  Tab Delimited (TSV)   2D SDfile   Computed 3D by Vconf -m prep SDfile
Find this compound or compounds like it in BindingDB:
Activity Spreadsheet -- Enzyme Inhibition Constant Data from BindingDB
Found 2 hits for monomerid = 50476866
TargetPresenilin-1(Homo sapiens (Human))
Bristol-Myers Squibb
Curated by ChEMBL
LigandPNGBDBM50476866(CHEMBL231941)
Affinity DataKi:  4.90nM. Assay description: Displacement of [3H]succinamide from gamma secretase in THP1 cell membranes
Ligand InfoPC cidPC sid
In DepthDetails ArticlePubMed
TargetPresenilin-1(Homo sapiens (Human))
Bristol-Myers Squibb
Curated by ChEMBL
LigandPNGBDBM50476866(CHEMBL231941)
Affinity DataIC50:  14nM. Assay description: Inhibition of gamma secretase in APP-transfected CHO cells
Ligand InfoPC cidPC sid
In DepthDetails ArticlePubMed