BDBM50476870 CHEMBL232346
SMILES CN1c2ccccc2C(=N[C@H](NC(=O)C2(CCC2)C(=O)NCCC2CCCC2)C1=O)c1ccc(cc1)C(F)(F)F
InChI Key InChIKey=PPYFVEDKELWYPU-RUZDIDTESA-N
Data  1 KI  1 IC50
  Tab Delimited (TSV)   2D SDfile   Computed 3D by Vconf -m prep SDfile
Find this compound or compounds like it in BindingDB:
Activity Spreadsheet -- Enzyme Inhibition Constant Data from BindingDB
Found 2 hits for monomerid = 50476870
TargetPresenilin-1(Homo sapiens (Human))
Bristol-Myers Squibb
Curated by ChEMBL
LigandPNGBDBM50476870(CHEMBL232346)
Affinity DataKi:  2.20nM. Assay description: Displacement of [3H]succinamide from gamma secretase in THP1 cell membranes
Ligand InfoPC cidPC sid
In DepthDetails ArticlePubMed
TargetPresenilin-1(Homo sapiens (Human))
Bristol-Myers Squibb
Curated by ChEMBL
LigandPNGBDBM50476870(CHEMBL232346)
Affinity DataIC50:  13nM. Assay description: Inhibition of gamma secretase in APP-transfected CHO cells
Ligand InfoPC cidPC sid
In DepthDetails ArticlePubMed