BDBM50476872 CHEMBL401045
SMILES CC(C)CNC(=O)C1(CCCC1)C(=O)N[C@H]1c2ccccc2-c2ccccc2N(C)C1=O
InChI Key InChIKey=ADNVRQBIELTLTL-QFIPXVFZSA-N
Data  1 KI  1 IC50
  Tab Delimited (TSV)   2D SDfile   Computed 3D by Vconf -m prep SDfile
Find this compound or compounds like it in BindingDB:
Activity Spreadsheet -- Enzyme Inhibition Constant Data from BindingDB
Found 2 hits for monomerid = 50476872
TargetPresenilin-1(Homo sapiens (Human))
Bristol-Myers Squibb
Curated by ChEMBL
LigandPNGBDBM50476872(CHEMBL401045)
Affinity DataKi:  3nM. Assay description: Displacement of [3H]succinamide from gamma secretase in THP1 cell membranes
Ligand InfoPC cidPC sid
In DepthDetails ArticlePubMed
TargetPresenilin-1(Homo sapiens (Human))
Bristol-Myers Squibb
Curated by ChEMBL
LigandPNGBDBM50476872(CHEMBL401045)
Affinity DataIC50:  26nM. Assay description: Inhibition of gamma secretase in APP-transfected CHO cells
Ligand InfoPC cidPC sid
In DepthDetails ArticlePubMed