BDBM50476955 CHEMBL397533
SMILES CCCC(C)N(c1cc(Cl)ccc1CO)S(=O)(=O)c1ccc(Br)cc1
InChI Key InChIKey=FIBNDASOWKUFPL-UHFFFAOYSA-N
Data  1 IC50
  Tab Delimited (TSV)   2D SDfile   Computed 3D by Vconf -m prep SDfile
Find this compound or compounds like it in BindingDB:
Activity Spreadsheet -- Enzyme Inhibition Constant Data from BindingDB
Found 1 hit for monomerid = 50476955
TargetPresenilin-1(Homo sapiens (Human))
Bristol-Myers Squibb Research And Development
Curated by ChEMBL
LigandPNGBDBM50476955(CHEMBL397533)
Affinity DataIC50:  56nM. Assay description: Inhibition of gamma secretase-mediated beta-APP cleavage in human H4 cells assessed by measuring Abeta40 production by ELISA
Ligand InfoPC cidPC sid
In DepthDetails ArticlePubMed