BDBM50477048 CHEMBL236597
SMILES CCC[C@H](NC(=O)[C@@H](O)C(C)(C)C)C(=O)Nc1ncc(s1)[C@@H](C)CCCC(C)(C)OC
InChI Key InChIKey=URHOPXMUZHWVON-XYJFISCASA-N
Data  2 IC50
  Tab Delimited (TSV)   2D SDfile   Computed 3D by Vconf -m prep SDfile
Find this compound or compounds like it in BindingDB:
Activity Spreadsheet -- Enzyme Inhibition Constant Data from BindingDB
Found 2 hits for monomerid = 50477048
TargetPresenilin-1(Homo sapiens (Human))
Pfizer
Curated by ChEMBL
LigandPNGBDBM50477048(CHEMBL236597)
Affinity DataIC50:  10nM. Assay description: Inhibition of gamma secretase C100Flag cleavaging activity in HeLa cell membranes assessed as M-amyloid beta-40 production by cell free assay
Ligand InfoPC cidPC sid
In DepthDetails ArticlePubMed
TargetPresenilin-1(Homo sapiens (Human))
Pfizer
Curated by ChEMBL
LigandPNGBDBM50477048(CHEMBL236597)
Affinity DataIC50:  0.110nM. Assay description: Inhibition of gamma secretase activity in human H4 cells transfected with APP695 mutant assessed as beta amyloid(1-40) production by whole cell assay
Ligand InfoPC cidPC sid
In DepthDetails ArticlePubMed