BDBM50478153 (R) aceclidine::(R)-ACECLIDINE
SMILES CC(=O)O[C@H]1CN2CCC1CC2
InChI Key InChIKey=WRJPSSPFHGNBMG-VIFPVBQESA-N
Data  1 KI
  Tab Delimited (TSV)   2D SDfile   Computed 3D by Vconf -m prep SDfile
Find this compound or compounds like it in BindingDB:
Activity Spreadsheet -- Enzyme Inhibition Constant Data from BindingDB
Found 1 hit for monomerid = 50478153
TargetMuscarinic acetylcholine receptor M2(Homo sapiens (Human))
Universit£
Curated by ChEMBL
LigandPNGBDBM50478153((R) aceclidine | (R)-ACECLIDINE)
Affinity DataKi:  2.24E+3nM. Assay description: Binding affinity to human cloned muscarinic M2 receptor expressed in CHO cells
In DepthDetails ArticlePubMed