BDBM50478155 (S)-ACECLIDINE
SMILES CC(=O)O[C@@H]1CN2CCC1CC2
InChI Key InChIKey=WRJPSSPFHGNBMG-SECBINFHSA-N
Data  1 KI
  Tab Delimited (TSV)   2D SDfile   Computed 3D by Vconf -m prep SDfile
Find this compound or compounds like it in BindingDB:
Activity Spreadsheet -- Enzyme Inhibition Constant Data from BindingDB
Found 1 hit for monomerid = 50478155
TargetMuscarinic acetylcholine receptor M2(Homo sapiens (Human))
Universit£
Curated by ChEMBL
LigandPNGBDBM50478155((S)-ACECLIDINE)
Affinity DataKi:  617nM. Assay description: Binding affinity to human cloned muscarinic M2 receptor expressed in CHO cells
In DepthDetails ArticlePubMed