BDBM50479265 Alternarienonic Acid
SMILES COc1cc(O)c(C(O)=O)c(c1)C1=C(C)C[C@@H](O)C1=O
InChI Key InChIKey=KZPGRZQYEBJXQJ-SNVBAGLBSA-N
Data  24 IC50
  Tab Delimited (TSV)   2D SDfile   Computed 3D by Vconf -m prep SDfile
Find this compound or compounds like it in BindingDB:
Activity Spreadsheet -- Enzyme Inhibition Constant Data from BindingDB
Found 24 hits for monomerid = 50479265
TargetAngiopoietin-1 receptor(Homo sapiens (Human))
Heinrich-Heine-Universit£T
Curated by ChEMBL
LigandPNGBDBM50479265(Alternarienonic Acid)
Affinity DataIC50: >3.59E+4nM. Assay description: Inhibition of recombinant TIE2
Ligand InfoPC cidPC sid
In DepthDetails ArticlePubMed
TargetCyclin-dependent kinase 4/G1/S-specific cyclin-D1(Homo sapiens (Human))
Heinrich-Heine-Universit£T
Curated by ChEMBL
LigandPNGBDBM50479265(Alternarienonic Acid)
Affinity DataIC50: >3.59E+4nM. Assay description: Inhibition of recombinant CDK4/CycD1
Ligand InfoPC cidPC sid
In DepthDetails ArticlePubMed
TargetMitogen-activated protein kinase kinase kinase 8(Homo sapiens (Human))
Heinrich-Heine-Universit£T
Curated by ChEMBL
LigandPNGBDBM50479265(Alternarienonic Acid)
Affinity DataIC50: >3.59E+4nM. Assay description: Inhibition of recombinant COT
Ligand InfoPC cidPC sid
In DepthDetails ArticlePubMed
TargetInsulin-like growth factor 1 receptor(Homo sapiens (Human))
Heinrich-Heine-Universit£T
Curated by ChEMBL
LigandPNGBDBM50479265(Alternarienonic Acid)
Affinity DataIC50:  1.29E+4nM. Assay description: Inhibition of recombinant IGF1R
Ligand InfoPC cidPC sid
In DepthDetails ArticlePubMed
TargetVascular endothelial growth factor receptor 2(Homo sapiens (Human))
Heinrich-Heine-Universit£T
Curated by ChEMBL
LigandPNGBDBM50479265(Alternarienonic Acid)
Affinity DataIC50:  1.83E+4nM. Assay description: Inhibition of recombinant VEGFR2
Ligand InfoPC cidPC sid
In DepthDetails ArticlePubMed
TargetVascular endothelial growth factor receptor 3(Homo sapiens (Human))
Heinrich-Heine-Universit£T
Curated by ChEMBL
LigandPNGBDBM50479265(Alternarienonic Acid)
Affinity DataIC50:  1.32E+4nM. Assay description: Inhibition of recombinant VEGFR3
Ligand InfoPC cidPC sid
In DepthDetails ArticlePubMed
TargetInsulin receptor(Homo sapiens (Human))
Heinrich-Heine-Universit£T
Curated by ChEMBL
LigandPNGBDBM50479265(Alternarienonic Acid)
Affinity DataIC50:  2.91E+4nM. Assay description: Inhibition of recombinant INSR
Ligand InfoPC cidPC sid
In DepthDetails ArticlePubMed
TargetPlatelet-derived growth factor receptor beta(Homo sapiens (Human))
Heinrich-Heine-Universit£T
Curated by ChEMBL
LigandPNGBDBM50479265(Alternarienonic Acid)
Affinity DataIC50: >3.59E+4nM. Assay description: Inhibition of recombinant PDGFRbeta
Ligand InfoPC cidPC sid
In DepthDetails ArticlePubMed
TargetSerine/threonine-protein kinase B-raf(Homo sapiens (Human))
Heinrich-Heine-Universit£T
Curated by ChEMBL
LigandPNGBDBM50479265(Alternarienonic Acid)
Affinity DataIC50:  3.23E+4nM. Assay description: Inhibition of recombinant B-RAF-V600E mutant
Ligand InfoPC cidPC sid
In DepthDetails ArticlePubMed
TargetEpidermal growth factor receptor(Homo sapiens (Human))
Heinrich-Heine-Universit£T
Curated by ChEMBL
LigandPNGBDBM50479265(Alternarienonic Acid)
Affinity DataIC50:  2.33E+4nM. Assay description: Inhibition of recombinant EGFR
Ligand InfoPC cidPC sid
In DepthDetails ArticlePubMed
TargetAurora kinase B(Homo sapiens (Human))
Heinrich-Heine-Universit£T
Curated by ChEMBL
LigandPNGBDBM50479265(Alternarienonic Acid)
Affinity DataIC50:  1.07E+4nM. Assay description: Inhibition of recombinant Aurora B
Ligand InfoPC cidPC sid
In DepthDetails ArticlePubMed
TargetProto-oncogene tyrosine-protein kinase Src(Homo sapiens (Human))
Heinrich-Heine-Universit£T
Curated by ChEMBL
LigandPNGBDBM50479265(Alternarienonic Acid)
Affinity DataIC50:  1.65E+4nM. Assay description: Inhibition of recombinant SRC
Ligand InfoPC cidPC sid
In DepthDetails ArticlePubMed
TargetRAC-alpha serine/threonine-protein kinase(Homo sapiens (Human))
Heinrich-Heine-Universit£T
Curated by ChEMBL
LigandPNGBDBM50479265(Alternarienonic Acid)
Affinity DataIC50: >3.59E+4nM. Assay description: Inhibition of recombinant AKT1
Ligand InfoPC cidPC sid
In DepthDetails ArticlePubMed
TargetFocal adhesion kinase 1(Homo sapiens (Human))
Heinrich-Heine-Universit£T
Curated by ChEMBL
LigandPNGBDBM50479265(Alternarienonic Acid)
Affinity DataIC50: >3.59E+4nM. Assay description: Inhibition of recombinant FAK
Ligand InfoPC cidPC sid
In DepthDetails ArticlePubMed
TargetEphrin type-B receptor 4(Homo sapiens (Human))
Heinrich-Heine-Universit£T
Curated by ChEMBL
LigandPNGBDBM50479265(Alternarienonic Acid)
Affinity DataIC50: >3.59E+4nM. Assay description: Inhibition of recombinant EPHB4
Ligand InfoPC cidPC sid
In DepthDetails ArticlePubMed
TargetCyclin-dependent kinase 2(Homo sapiens (Human))
Heinrich-Heine-Universit£T
Curated by ChEMBL
LigandPNGBDBM50479265(Alternarienonic Acid)
Affinity DataIC50: >3.59E+4nM. Assay description: Inhibition of recombinant CDK2/CycA
Ligand InfoPC cidPC sid
In DepthDetails ArticlePubMed
TargetReceptor-type tyrosine-protein kinase FLT3(Homo sapiens (Human))
Heinrich-Heine-Universit£T
Curated by ChEMBL
LigandPNGBDBM50479265(Alternarienonic Acid)
Affinity DataIC50:  2.37E+4nM. Assay description: Inhibition of recombinant FLT3
Ligand InfoPC cidPC sid
In DepthDetails ArticlePubMed
TargetNUAK family SNF1-like kinase 1(Homo sapiens (Human))
Heinrich-Heine-Universit£T
Curated by ChEMBL
LigandPNGBDBM50479265(Alternarienonic Acid)
Affinity DataIC50:  1.43E+4nM. Assay description: Inhibition of recombinant ARK5
Ligand InfoPC cidPC sid
In DepthDetails ArticlePubMed
TargetSerine/threonine-protein kinase PLK1(Homo sapiens (Human))
Heinrich-Heine-Universit£T
Curated by ChEMBL
LigandPNGBDBM50479265(Alternarienonic Acid)
Affinity DataIC50: >3.59E+4nM. Assay description: Inhibition of recombinant PLK1
Ligand InfoPC cidPC sid
In DepthDetails ArticlePubMed
TargetCasein kinase II subunit alpha(Homo sapiens (Human))
Heinrich-Heine-Universit£T
Curated by ChEMBL
LigandPNGBDBM50479265(Alternarienonic Acid)
Affinity DataIC50: >3.59E+4nM. Assay description: Inhibition of recombinant CK2alpha1
Ligand InfoPC cidPC sid
In DepthDetails ArticlePubMed
TargetHepatocyte growth factor receptor(Homo sapiens (Human))
Heinrich-Heine-Universit£T
Curated by ChEMBL
LigandPNGBDBM50479265(Alternarienonic Acid)
Affinity DataIC50:  3.37E+4nM. Assay description: Inhibition of recombinant MET
Ligand InfoPC cidPC sid
In DepthDetails ArticlePubMed
TargetSerine/threonine-protein kinase PLK4(Homo sapiens (Human))
Heinrich-Heine-Universit£T
Curated by ChEMBL
LigandPNGBDBM50479265(Alternarienonic Acid)
Affinity DataIC50:  8.98E+3nM. Assay description: Inhibition of recombinant SAK
Ligand InfoPC cidPC sid
In DepthDetails ArticlePubMed
TargetAurora kinase A(Homo sapiens (Human))
Heinrich-Heine-Universit£T
Curated by ChEMBL
LigandPNGBDBM50479265(Alternarienonic Acid)
Affinity DataIC50:  1.58E+4nM. Assay description: Inhibition of recombinant Aurora A
Ligand InfoPC cidPC sid
In DepthDetails ArticlePubMed
TargetReceptor tyrosine-protein kinase erbB-2(Homo sapiens (Human))
Heinrich-Heine-Universit£T
Curated by ChEMBL
LigandPNGBDBM50479265(Alternarienonic Acid)
Affinity DataIC50: >3.59E+4nM. Assay description: Inhibition of recombinant ERBB2
Ligand InfoPC cidPC sid
In DepthDetails ArticlePubMed