BDBM50479325 CHEMBL514555
SMILES CCN1CC(CC1=O)c1nc(C(=O)NCc2ccc(F)cc2S(C)(=O)=O)c(O)c2ncccc12
InChI Key InChIKey=YSIMBNDIQQVRNI-UHFFFAOYSA-N
Data  1 IC50
  Tab Delimited (TSV)   2D SDfile   Computed 3D by Vconf -m prep SDfile
Find this compound or compounds like it in BindingDB:
Activity Spreadsheet -- Enzyme Inhibition Constant Data from BindingDB
Found 1 hit for monomerid = 50479325
TargetIntegrase(Human immunodeficiency virus 1)
Merck Research Laboratories
Curated by ChEMBL
LigandPNGBDBM50479325(CHEMBL514555)
Affinity DataIC50:  26nM. Assay description: Inhibition of recombinant HIV1 integrase strand transfer activity using immobilized DNA substrate
Ligand InfoPC cidPC sid
In DepthDetails ArticlePubMed