BDBM50479350 CHEMBL491828
SMILES CN(C)c1ccc(\C=C\C2=[O+][B-](F)(F)Oc3cc(C)oc(=O)c23)cc1
InChI Key InChIKey=YMILSBFGDQXRSH-RMKNXTFCSA-N
Data  2 IC50
  Tab Delimited (TSV)   2D SDfile   Computed 3D by Vconf -m prep SDfile
Find this compound or compounds like it in BindingDB:
Activity Spreadsheet -- Enzyme Inhibition Constant Data from BindingDB
Found 2 hits for monomerid = 50479350
TargetIntegrase(Human immunodeficiency virus 1)
University Of Southern California
Curated by ChEMBL
LigandPNGBDBM50479350(CHEMBL491828)
Affinity DataIC50: >1.00E+5nM. Assay description: Inhibition of wild-type HIV1 integrase 3'-end processing activity
Ligand InfoPC cidPC sid
In DepthDetails ArticlePubMed
TargetIntegrase(Human immunodeficiency virus 1)
University Of Southern California
Curated by ChEMBL
LigandPNGBDBM50479350(CHEMBL491828)
Affinity DataIC50:  5.60E+4nM. Assay description: Inhibition of wild-type HIV1 integrase strand transfer activity
Ligand InfoPC cidPC sid
In DepthDetails ArticlePubMed