BDBM50479865 Platensimycin
SMILES [H][C@@]12CC3C[C@]4(CC3(C)O1)C=CC(=O)[C@@](C)(CCC(=O)Nc1c(O)ccc(C(O)=O)c1O)C24
InChI Key InChIKey=CSOMAHTTWTVBFL-RRSCQWGLSA-N
Data  1 IC50
  Tab Delimited (TSV)   2D SDfile   Computed 3D by Vconf -m prep SDfile
Find this compound or compounds like it in BindingDB:
Activity Spreadsheet -- Enzyme Inhibition Constant Data from BindingDB
Found 1 hit for monomerid = 50479865
Target3-oxoacyl-[acyl-carrier-protein] synthase 2(Staphylococcus aureus)
Merck Research Laboratories
Curated by ChEMBL
LigandPNGBDBM50479865(Platensimycin)
Affinity DataIC50:  1.13E+3nM. Assay description: Inhibition of FabF-mediated type 2 fatty acid synthesis in Staphylococcus aureus by cell free assay
In DepthDetails ArticlePubMed