BDBM50480057 CHEMBL523832
SMILES [H][C@]12CC[C@]([H])(Cc3cc(ccc3C1)-c1cc(-c3ccc(F)cc3)n(C)n1)[C@@]21CN(CC(F)(F)F)S(=O)(=O)N1
InChI Key InChIKey=MNWXELRUSOMFCS-BPYKYCOYSA-N
Data  1 IC50
  Tab Delimited (TSV)   2D SDfile   Computed 3D by Vconf -m prep SDfile
Find this compound or compounds like it in BindingDB:
Activity Spreadsheet -- Enzyme Inhibition Constant Data from BindingDB
Found 1 hit for monomerid = 50480057
TargetPresenilin-1(Homo sapiens (Human))
Merck Sharp & Dohme Research Laboratories
Curated by ChEMBL
LigandPNGBDBM50480057(CHEMBL523832)
Affinity DataIC50:  0.0600nM. Assay description: Inhibition of gamma secretase in human SH-SY5Y cells by HTRF assay
Ligand InfoPC cidPC sid
In DepthDetails ArticlePubMed