BDBM50480240 CHEMBL486939
SMILES Cc1nc(nc(C)c1CC=C)N1C(SCC1=O)c1c(F)cccc1Cl
InChI Key InChIKey=CQVMOHCSXRLXFE-UHFFFAOYSA-N
Data  1 IC50
  Tab Delimited (TSV)   2D SDfile   Computed 3D by Vconf -m prep SDfile
Find this compound or compounds like it in BindingDB:
Activity Spreadsheet -- Enzyme Inhibition Constant Data from BindingDB
Found 1 hit for monomerid = 50480240
TargetReverse transcriptase(Human immunodeficiency virus 1)
Hebei University
Curated by ChEMBL
LigandPNGBDBM50480240(CHEMBL486939)
Affinity DataIC50:  2.92E+3nM. Assay description: Inhibition of HIV1 reverse transcriptase after 1 hr by ELISA
Ligand InfoPC cidPC sid
In DepthDetails ArticlePubMed