BDBM50480530 CHEMBL556473
SMILES Oc1ccc2C(=O)N(Cc3cccc(Cl)c3F)C(=O)c2c1O
InChI Key InChIKey=WMFOJSRDGWZYSC-UHFFFAOYSA-N
Data  4 IC50
PDB links: 1 PDB ID matches this monomer.
  Tab Delimited (TSV)   2D SDfile   Computed 3D by Vconf -m prep SDfile
Find this compound or compounds like it in BindingDB:
Activity Spreadsheet -- Enzyme Inhibition Constant Data from BindingDB
Found 4 hits for monomerid = 50480530
TargetIntegrase(Human immunodeficiency virus 1)
National Cancer Institute-Frederick
Curated by ChEMBL
LigandPNGBDBM50480530(CHEMBL556473)
Affinity DataIC50:  2.50E+4nM. Assay description: Inhibition of HIV1 integrase 3'-processing activity in presence of magnesium
Ligand InfoPC cidPC sidPDB
In DepthDetails ArticlePubMed
TargetIntegrase(Human immunodeficiency virus 1)
National Cancer Institute-Frederick
Curated by ChEMBL
LigandPNGBDBM50480530(CHEMBL556473)
Affinity DataIC50:  1.70E+3nM. Assay description: Inhibition of HIV1 recombinant integrase strand transfer activity expressed in Escherichia coli after 30 mins using [32P]-labeled oligonucleotide as ...
Ligand InfoPC cidPC sidPDB
In DepthDetails ArticlePubMed
TargetIntegrase(Human immunodeficiency virus 1)
National Cancer Institute-Frederick
Curated by ChEMBL
LigandPNGBDBM50480530(CHEMBL556473)
Affinity DataIC50:  2.50E+4nM. Assay description: Inhibition of HIV1 recombinant integrase 3'-processing activity expressed in Escherichia coli after 30 mins using [32P]-labeled oligonucleotide as a ...
Ligand InfoPC cidPC sidPDB
In DepthDetails ArticlePubMed
TargetIntegrase(Human immunodeficiency virus 1)
National Cancer Institute-Frederick
Curated by ChEMBL
LigandPNGBDBM50480530(CHEMBL556473)
Affinity DataIC50:  2.00E+3nM. Assay description: Inhibition of HIV1 integrase strand transfer activity in presence of magnesium
Ligand InfoPC cidPC sidPDB
In DepthDetails ArticlePubMed