BDBM50480682 CHEMBL551401
SMILES CCN(CC)CCN1CCn2c(nc(C(=O)NCc3ccc(F)cc3)c(O)c2=O)C1(C)C
InChI Key InChIKey=SNEKHSBOTJOLDR-UHFFFAOYSA-N
Data  1 IC50
  Tab Delimited (TSV)   2D SDfile   Computed 3D by Vconf -m prep SDfile
Find this compound or compounds like it in BindingDB:
Activity Spreadsheet -- Enzyme Inhibition Constant Data from BindingDB
Found 1 hit for monomerid = 50480682
TargetIntegrase(Human immunodeficiency virus 1)
Irbm-Mrl
Curated by ChEMBL
LigandPNGBDBM50480682(CHEMBL551401)
Affinity DataIC50:  76nM. Assay description: Inhibition of HIV1 recombinant integrase strand transfer activity treated after enzyme assembly and washing
Ligand InfoPC cidPC sid
In DepthDetails ArticlePubMed