BDBM50481174 CHEMBL565861
SMILES CCNC(=O)[C@@H]1N(Cc2ccccc12)C(=O)c1cc(Cl)c(O)cc1O
InChI Key InChIKey=QITRQXXSCAOQLZ-MRXNPFEDSA-N
Data  1 IC50
PDB links: 1 PDB ID matches this monomer.
  Tab Delimited (TSV)   2D SDfile   Computed 3D by Vconf -m prep SDfile
Find this compound or compounds like it in BindingDB:
Activity Spreadsheet -- Enzyme Inhibition Constant Data from BindingDB
Found 1 hit for monomerid = 50481174
TargetHeat shock protein HSP 90-alpha/90-beta(Homo sapiens (Human))
Pfizer
Curated by ChEMBL
LigandPNGBDBM50481174(CHEMBL565861)
Affinity DataIC50:  300nM. Assay description: Inhibition of Hsp90 in human H1299 assessed as degradation of Hsp90 client protein Akt
Ligand InfoPC cidPC sidPDB