BDBM50482848 CHEMBL1258249
SMILES COc1cc(cc(C)c1Oc1nc(NC2CCN(CC2)c2cccc(c2)C(N)=O)ncc1Br)C#N
InChI Key InChIKey=QBVPZFQWBKTFNA-UHFFFAOYSA-N
Data  2 IC50
  Tab Delimited (TSV)   2D SDfile   Computed 3D by Vconf -m prep SDfile
Find this compound or compounds like it in BindingDB:
Activity Spreadsheet -- Enzyme Inhibition Constant Data from BindingDB
Found 2 hits for monomerid = 50482848
TargetReverse transcriptase(Human immunodeficiency virus 1)
Roche R&D Center China
Curated by ChEMBL
LigandPNGBDBM50482848(CHEMBL1258249)
Affinity DataIC50:  56nM. Assay description: Inhibition of HIV1 recombinant wild type reverse transcriptase by SPA heteropolymeric assay
Ligand InfoPC cidPC sid
In DepthDetails ArticlePubMed
TargetReverse transcriptase protein(Human immunodeficiency virus 1)
Roche R&D Center China
Curated by ChEMBL
LigandPNGBDBM50482848(CHEMBL1258249)
Affinity DataIC50:  56nM. Assay description: Inhibition of HIV1 recombinant reverse transcriptase K103N/Y181C double mutant by SPA heteropolymeric assay
Ligand InfoPC cidPC sid
In DepthDetails ArticlePubMed