BDBM50483028 CHEMBL1276359
SMILES CCOc1ccc(CCc2ccc(O)c(O)c2O)cc1OCC
InChI Key InChIKey=HGBQETNPAMDMEL-UHFFFAOYSA-N
Data  1 IC50
  Tab Delimited (TSV)   2D SDfile   Computed 3D by Vconf -m prep SDfile
Find this compound or compounds like it in BindingDB:
Activity Spreadsheet -- Enzyme Inhibition Constant Data from BindingDB
Found 1 hit for monomerid = 50483028
TargetUrease subunit beta(Helicobacter pylori (strain ATCC 700392 / 26695) (...)
Jishou University
Curated by ChEMBL
LigandPNGBDBM50483028(CHEMBL1276359)
Affinity DataIC50:  6.90E+4nM. Assay description: Inhibition of cell free Helicobacter pylori ATCC 43504 urease assessed as reduction in ammonia production by indophenol based Berthelot color reactio...
Ligand InfoPC cidPC sid
In DepthDetails ArticlePubMed