BDBM50483068 CHEMBL1276097
SMILES COC(=O)Nc1cccc(c1)N1C[C@H](OC1=O)C(=O)N[C@@H](Cc1ccccc1)[C@H](O)CN(CC(C)C)S(=O)(=O)c1ccc(OC)cc1
InChI Key InChIKey=FRCJHWGIWFZPAD-JBOQNHBVSA-N
Data  1 KI
  Tab Delimited (TSV)   2D SDfile   Computed 3D by Vconf -m prep SDfile
Find this compound or compounds like it in BindingDB:
Activity Spreadsheet -- Enzyme Inhibition Constant Data from BindingDB
Found 1 hit for monomerid = 50483068
TargetProtease(Human immunodeficiency virus 1 (HIV-1))
University Of Massachusetts Medical School
Curated by ChEMBL
LigandPNGBDBM50483068(CHEMBL1276097)
Affinity DataKi:  0.163nM. Assay description: Inhibition of wild type HIV1 protease by FRET
Ligand InfoPC cidPC sid
In DepthDetails ArticlePubMed