BDBM50483116 CHEMBL1276096
SMILES CC(C)CN(C[C@@H](O)[C@H](Cc1ccccc1)NC(=O)[C@@H]1CN(C(=O)O1)c1cccc(NC(C)=O)c1)S(=O)(=O)c1ccc2ncsc2c1
InChI Key InChIKey=BSAYNLUMUHCMBR-JBOQNHBVSA-N
Data  1 KI
  Tab Delimited (TSV)   2D SDfile   Computed 3D by Vconf -m prep SDfile
Find this compound or compounds like it in BindingDB:
Activity Spreadsheet -- Enzyme Inhibition Constant Data from BindingDB
Found 1 hit for monomerid = 50483116
TargetProtease(Human immunodeficiency virus 1 (HIV-1))
University Of Massachusetts Medical School
Curated by ChEMBL
LigandPNGBDBM50483116(CHEMBL1276096)
Affinity DataKi:  0.00600nM. Assay description: Inhibition of wild type HIV1 protease by FRET
Ligand InfoPC cidPC sid
In DepthDetails ArticlePubMed